[P4-dev] Error when running installation script

Vibhaalakshmi Sivaraman vibhaa at princeton.edu
Wed Feb 10 11:10:54 EST 2016

I am running into the following errors while running the install script as
specified at https://github.com/p4lang/p4factory. What might be causing
this and how should I go about fixing this?

g++ -DHAVE_CONFIG_H -I. -I../.. -I../../lib/cpp/src/thrift  -I./src  -Wall
-Wextra -pedantic -g -O2 -std=c++11 -MT thrift-t_csharp_generator.o -MD -MP
-MF .deps/thrift-t_csharp_generator.Tpo -c -o thrift-t_csharp_generator.o
`test -f 'src/generate/t_csharp_generator.cc' || echo
g++: internal compiler error: Killed (program cc1plus)
Please submit a full bug report,
with preprocessed source if appropriate.
See <file:///usr/share/doc/gcc-4.8/README.Bugs> for instructions.
make[3]: *** [thrift-t_c_glib_generator.o] Error 4
make[3]: *** Waiting for unfinished jobs....
mv -f .deps/thrift-t_java_generator.Tpo .deps/thrift-t_java_generator.Po
mv -f .deps/thrift-t_csharp_generator.Tpo .deps/thrift-t_csharp_generator.Po
mv -f .deps/thrift-t_cpp_generator.Tpo .deps/thrift-t_cpp_generator.Po
make[3]: Leaving directory `/home/vibhaa/p4factory/install_tmp/thrift-0.9.2/
make[2]: *** [all] Error 2
make[2]: Leaving directory `/home/vibhaa/p4factory/install_tmp/thrift-0.9.2/
make[1]: *** [all-recursive] Error 1
make[1]: Leaving directory `/home/vibhaa/p4factory/install_tmp/thrift-0.9.2'
make: *** [all] Error 2


Vibhaalakshmi Sivaraman
Computer Science
Princeton University '17
-------------- next part --------------
An HTML attachment was scrubbed...
URL: <http://lists.p4.org/pipermail/p4-dev_lists.p4.org/attachments/20160210/0d81061a/attachment-0002.html>

More information about the P4-dev mailing list