[P4-dev] gtestp4c fails with p4c make check

hemant at mnkcg.com hemant at mnkcg.com
Mon Oct 16 20:34:24 EDT 2017


Folks,

 

A p4c downloaded today fails gtestp4c when I run "make check".  Would you
know what causes such a failure? 

 

The following tests FAILED:

     641 - gtestp4c (Failed)

Errors while running CTest

CMakeFiles/check-all.dir/build.make:49: recipe for target
'CMakeFiles/check-all' failed

make[3]: *** [CMakeFiles/check-all] Error 8

CMakeFiles/Makefile2:91: recipe for target 'CMakeFiles/check-all.dir/all'
failed

make[2]: *** [CMakeFiles/check-all.dir/all] Error 2

CMakeFiles/Makefile2:68: recipe for target 'CMakeFiles/check.dir/rule'
failed

make[1]: *** [CMakeFiles/check.dir/rule] Error 2

Makefile:160: recipe for target 'check' failed

make: *** [check] Error 2

 

Hemant

-------------- next part --------------
An HTML attachment was scrubbed...
URL: <http://lists.p4.org/pipermail/p4-dev_lists.p4.org/attachments/20171016/5e6449c6/attachment-0002.html>


More information about the P4-dev mailing list