[P4-dev] gtestp4c fails with p4c make check

Mihai Budiu mbudiu at vmware.com
Mon Oct 16 20:36:33 EDT 2017


This is probably issue https://github.com/p4lang/p4c/issues/924
Unfortunately the error output from make check for gtestp4c is not easy to interpret.
I am CC-ing Seth, who is assigned for this issue.

Mihai

From: P4-dev [mailto:p4-dev-bounces at lists.p4.org] On Behalf Of hemant at mnkcg.com
Sent: Monday, October 16, 2017 5:34 PM
To: p4-dev at lists.p4.org
Subject: [P4-dev] gtestp4c fails with p4c make check

Folks,

A p4c downloaded today fails gtestp4c when I run "make check".  Would you know what causes such a failure?

The following tests FAILED:
     641 - gtestp4c (Failed)
Errors while running CTest
CMakeFiles/check-all.dir/build.make:49: recipe for target 'CMakeFiles/check-all' failed
make[3]: *** [CMakeFiles/check-all] Error 8
CMakeFiles/Makefile2:91: recipe for target 'CMakeFiles/check-all.dir/all' failed
make[2]: *** [CMakeFiles/check-all.dir/all] Error 2
CMakeFiles/Makefile2:68: recipe for target 'CMakeFiles/check.dir/rule' failed
make[1]: *** [CMakeFiles/check.dir/rule] Error 2
Makefile:160: recipe for target 'check' failed
make: *** [check] Error 2

Hemant
-------------- next part --------------
An HTML attachment was scrubbed...
URL: <http://lists.p4.org/pipermail/p4-dev_lists.p4.org/attachments/20171017/29da335f/attachment-0002.html>


More information about the P4-dev mailing list