[P4-dev] latest p4c and behavioral-model test failures

hemant at mnkcg.com hemant at mnkcg.com
Sun Dec 9 15:04:39 EST 2018


I did that before sending my email.  I have highlighted the error in yellow
highlight below.  Interestingly, the arp_rarp_t header does have the field
prototype.

 

hemant at ubuntu:~/p4c-1/build$
bmv2/testdata/p4_14_samples/switch_20160226/switch.p4.test -v

Writing temporary files into  ./tmpOAvsln

Executing  ./p4c-bm2-ss -o
bmv2/testdata/p4_14_samples/switch_20160226/switch.json --std p4-14
/home/hemant/p4c-1/testdata/p4_14_samples/switch_20160226/switch.p4

Exit code  1

Error compiling

/home/hemant/p4c-1/testdata/p4_14_samples/switch_20160226/l3.p4(140):
warning: -1: negative value with unsigned type

    add_to_field(ipv4.ttl, -1);

                            ^

/home/hemant/p4c-1/testdata/p4_14_samples/switch_20160226/l3.p4(150):
warning: -1: negative value with unsigned type

    add_to_field(ipv4.ttl, -1);

                            ^

/home/hemant/p4c-1/testdata/p4_14_samples/switch_20160226/l3.p4(156):
warning: -1: negative value with unsigned type

    add_to_field(ipv6.hopLimit, -1);

                                 ^

/home/hemant/p4c-1/testdata/p4_14_samples/switch_20160226/l3.p4(166):
warning: -1: negative value with unsigned type

    add_to_field(ipv6.hopLimit, -1);

                                 ^

/home/hemant/p4c-1/testdata/p4_14_samples/switch_20160226/l3.p4(172):
warning: -1: negative value with unsigned type

    add_to_field(mpls[0].ttl, -1);

                               ^

/home/hemant/p4c-1/testdata/p4_14_samples/switch_20160226/tunnel.p4(880):
warning: -14: negative value with unsigned type

    add(egress_metadata.payload_length, standard_metadata.packet_length,
-14);

                                                                          ^^

/home/hemant/p4c-1/testdata/p4_14_samples/switch_20160226/fabric.p4(230):
warning: Could not infer type for fabric_mgid, using bit<8>

action set_fabric_multicast(fabric_mgid) {

                            ^^^^^^^^^^^

/home/hemant/p4c-1/testdata/p4_14_samples/switch_20160226/acl.p4(436):
warning: Could not infer type for session_id, using bit<8>

action negative_mirror(session_id) {

                       ^^^^^^^^^^

warning: The order of headers in deparser is not uniquely determined by
parser!

warning: 1024: Size specified for table without keys

warning: 1024: Size specified for table without keys

/home/hemant/p4c-1/testdata/p4_14_samples/switch_20160226/includes/parser.p4
(603): error: Structure header arp_rarp_t does not have a field protoType

    return select(latest.protoType) {

                         ^^^^^^^^^

 

Removing ./tmpOAvsln

*** Test failed

 

From: Mihai Budiu <mbudiu at vmware.com> 
Sent: Sunday, December 09, 2018 2:55 PM
To: hemant at mnkcg.com
Subject: RE: [P4-dev] latest p4c and behavioral-model test failures

 

Run one test manually and see what the error is.

 

  _____  

From: P4-dev <p4-dev-bounces at lists.p4.org
<mailto:p4-dev-bounces at lists.p4.org> > on behalf of hemant at mnkcg.com
<mailto:hemant at mnkcg.com>  <hemant at mnkcg.com <mailto:hemant at mnkcg.com> >
Sent: Sunday, December 9, 2018 11:23:46 AM
To: 'p4-dev'
Subject: [P4-dev] latest p4c and behavioral-model test failures 

 

This is the first time I am using the behavioral-model with p4c.  Since
tests failed with my code changes to p4c, I downloaded the latest p4c and
this code also fails with the same tests.  Maybe, I have not setup something
for the behavioral-model.  However, I see travis also failing with roughly
the same tests in my PR. 

 

75% tests passed, 304 tests failed out of 1195

 

Label Time Summary:

XFAIL          =   7.41 sec*proc (13 tests)

bmv2           = 401.70 sec*proc (328 tests)

cpplint        =  23.03 sec*proc (1 test)

ebpf           =  27.39 sec*proc (13 tests)

ebpf-bcc       =   5.18 sec*proc (13 tests)

ebpf-kernel    =   8.20 sec*proc (13 tests)

gtest          =   2.34 sec*proc (1 test)

p14_to_16      = 225.14 sec*proc (198 tests)

p4             = 213.66 sec*proc (628 tests)

 

Total Test time (real) = 907.93 sec

 

The following tests FAILED:

     14 - bmv2/testdata/p4_14_samples/switch_20160226/switch.p4 (Failed)

     15 - bmv2/testdata/p4_14_samples/switch_20160512/switch.p4 (Failed)

     16 - bmv2/testdata/p4_14_samples/01-BigMatch.p4 (Failed)

     17 - bmv2/testdata/p4_14_samples/01-DeadMetadata1.p4 (Failed)

     18 - bmv2/testdata/p4_14_samples/01-FullPHV.p4 (Failed)

     19 - bmv2/testdata/p4_14_samples/01-JustEthernet.p4 (Failed)

     20 - bmv2/testdata/p4_14_samples/01-NoDeps.p4 (Failed)

     21 - bmv2/testdata/p4_14_samples/02-BadSizeField.p4 (Failed)

     22 - bmv2/testdata/p4_14_samples/02-DeadMetadata2.p4 (Failed)

     23 - bmv2/testdata/p4_14_samples/02-FullPHV1.p4 (Failed)

     24 - bmv2/testdata/p4_14_samples/02-SplitEthernet.p4 (Failed)

     25 - bmv2/testdata/p4_14_samples/03-DeadMetadata3.p4 (Failed)

     26 - bmv2/testdata/p4_14_samples/03-FullPHV2.p4 (Failed)

     27 - bmv2/testdata/p4_14_samples/03-Gateway.p4 (Failed)

     28 - bmv2/testdata/p4_14_samples/03-SplitEthernetCompact.p4 (Failed)

     29 - bmv2/testdata/p4_14_samples/04-GatewayDefault.p4 (Failed)

     30 - bmv2/testdata/p4_14_samples/04-SimpleVlan.p4 (Failed)

     31 - bmv2/testdata/p4_14_samples/05-FieldProblem.p4 (Failed)

     32 - bmv2/testdata/p4_14_samples/05-FullTPHV.p4 (Failed)

     33 - bmv2/testdata/p4_14_samples/05-SimpleVlan1.p4 (Failed)

     34 - bmv2/testdata/p4_14_samples/06-FullTPHV1.p4 (Failed)

     35 - bmv2/testdata/p4_14_samples/06-SimpleVlanStack.p4 (Failed)

     36 - bmv2/testdata/p4_14_samples/07-FullTPHV2.p4 (Failed)

     37 - bmv2/testdata/p4_14_samples/07-MultiProtocol.p4 (Failed)

     38 - bmv2/testdata/p4_14_samples/07-SimpleVlanStackIP.p4 (Failed)

     39 - bmv2/testdata/p4_14_samples/08-FullTPHV3.p4 (Failed)

     40 - bmv2/testdata/p4_14_samples/08-MultiProtocolIfElse.p4 (Failed)

     41 - bmv2/testdata/p4_14_samples/08-SimpleVlanStackIPSplitFlags.p4
(Failed)

     42 - bmv2/testdata/p4_14_samples/09-IPv4OptionsUnparsed.p4 (Failed)

     43 - bmv2/testdata/p4_14_samples/10-SelectPriorities.p4 (Failed)

     44 - bmv2/testdata/p4_14_samples/11-MultiTags.p4 (Failed)

     45 - bmv2/testdata/p4_14_samples/12-Counters.p4 (Failed)

     46 - bmv2/testdata/p4_14_samples/12-MultiTagsNoLoop.p4 (Failed)

     47 - bmv2/testdata/p4_14_samples/13-Counters1and2.p4 (Failed)

     48 - bmv2/testdata/p4_14_samples/13-MultiTagsCorrect.p4 (Failed)

     49 - bmv2/testdata/p4_14_samples/14-Counter.p4 (Failed)

     50 - bmv2/testdata/p4_14_samples/14-GatewayGreaterThan.p4 (Failed)

     51 - bmv2/testdata/p4_14_samples/15-MultiProtocolIfElseMinimal.p4
(Failed)

     52 - bmv2/testdata/p4_14_samples/16-NoHeaders.p4 (Failed)

     53 - bmv2/testdata/p4_14_samples/16-TwoReferences.p4 (Failed)

     54 - bmv2/testdata/p4_14_samples/17-Minimal.p4 (Failed)

     55 - bmv2/testdata/p4_14_samples/18-EmptyPipelines.p4 (Failed)

     56 - bmv2/testdata/p4_14_samples/TLV_parsing.p4 (Failed)

     57 - bmv2/testdata/p4_14_samples/acl1.p4 (Failed)

     58 - bmv2/testdata/p4_14_samples/action_bus1.p4 (Failed)

     59 - bmv2/testdata/p4_14_samples/action_chain1.p4 (Failed)

     60 - bmv2/testdata/p4_14_samples/action_inline.p4 (Failed)

     61 - bmv2/testdata/p4_14_samples/action_inline1.p4 (Failed)

     62 - bmv2/testdata/p4_14_samples/action_inline2.p4 (Failed)

     63 - bmv2/testdata/p4_14_samples/axon.p4 (Failed)

     64 - bmv2/testdata/p4_14_samples/basic_conditionals.p4 (Failed)

     65 - bmv2/testdata/p4_14_samples/basic_routing.p4 (Failed)

     66 - bmv2/testdata/p4_14_samples/bigfield1.p4 (Failed)

     67 - bmv2/testdata/p4_14_samples/bridge1.p4 (Failed)

     68 - bmv2/testdata/p4_14_samples/checksum.p4 (Failed)

     69 - bmv2/testdata/p4_14_samples/checksum1.p4 (Failed)

     70 - bmv2/testdata/p4_14_samples/checksum_pragma.p4 (Failed)

     71 - bmv2/testdata/p4_14_samples/const_default_action.p4 (Failed)

     72 - bmv2/testdata/p4_14_samples/copy_to_cpu.p4 (Failed)

     73 - bmv2/testdata/p4_14_samples/counter.p4 (Failed)

     74 - bmv2/testdata/p4_14_samples/counter1.p4 (Failed)

     75 - bmv2/testdata/p4_14_samples/counter2.p4 (Failed)

     76 - bmv2/testdata/p4_14_samples/counter3.p4 (Failed)

     77 - bmv2/testdata/p4_14_samples/counter4.p4 (Failed)

     78 - bmv2/testdata/p4_14_samples/counter5.p4 (Failed)

     79 - bmv2/testdata/p4_14_samples/do_nothing.p4 (Failed)

     80 - bmv2/testdata/p4_14_samples/double_apply.p4 (Failed)

     81 - bmv2/testdata/p4_14_samples/exact_match1.p4 (Failed)

     82 - bmv2/testdata/p4_14_samples/exact_match2.p4 (Failed)

     83 - bmv2/testdata/p4_14_samples/exact_match3.p4 (Failed)

     84 - bmv2/testdata/p4_14_samples/exact_match4.p4 (Failed)

     85 - bmv2/testdata/p4_14_samples/exact_match5.p4 (Failed)

     86 - bmv2/testdata/p4_14_samples/exact_match6.p4 (Failed)

     87 - bmv2/testdata/p4_14_samples/exact_match7.p4 (Failed)

     88 - bmv2/testdata/p4_14_samples/exact_match8.p4 (Failed)

     89 - bmv2/testdata/p4_14_samples/exact_match9.p4 (Failed)

     90 - bmv2/testdata/p4_14_samples/exact_match_mask1.p4 (Failed)

     91 - bmv2/testdata/p4_14_samples/exact_match_valid1.p4 (Failed)

     92 - bmv2/testdata/p4_14_samples/flowlet_switching.p4 (Failed)

     93 - bmv2/testdata/p4_14_samples/gateway1.p4 (Failed)

     94 - bmv2/testdata/p4_14_samples/gateway2.p4 (Failed)

     95 - bmv2/testdata/p4_14_samples/gateway3.p4 (Failed)

     96 - bmv2/testdata/p4_14_samples/gateway4.p4 (Failed)

     97 - bmv2/testdata/p4_14_samples/gateway5.p4 (Failed)

     98 - bmv2/testdata/p4_14_samples/gateway6.p4 (Failed)

     99 - bmv2/testdata/p4_14_samples/gateway7.p4 (Failed)

     100 - bmv2/testdata/p4_14_samples/gateway8.p4 (Failed)

     101 - bmv2/testdata/p4_14_samples/hash_action_basic.p4 (Failed)

     102 - bmv2/testdata/p4_14_samples/hash_action_gateway.p4 (Failed)

     103 - bmv2/testdata/p4_14_samples/hash_action_gateway2.p4 (Failed)

     104 - bmv2/testdata/p4_14_samples/hash_action_two_same.p4 (Failed)

     105 - bmv2/testdata/p4_14_samples/hash_action_two_separate.p4 (Failed)

     106 - bmv2/testdata/p4_14_samples/header-stack-ops-bmv2.p4 (Failed)

     107 - bmv2/testdata/p4_14_samples/hit.p4 (Failed)

     108 - bmv2/testdata/p4_14_samples/hitmiss.p4 (Failed)

     109 - bmv2/testdata/p4_14_samples/inline.p4 (Failed)

     110 - bmv2/testdata/p4_14_samples/instruct1.p4 (Failed)

     111 - bmv2/testdata/p4_14_samples/instruct2.p4 (Failed)

     112 - bmv2/testdata/p4_14_samples/instruct3.p4 (Failed)

     113 - bmv2/testdata/p4_14_samples/instruct4.p4 (Failed)

     114 - bmv2/testdata/p4_14_samples/instruct5.p4 (Failed)

     115 - bmv2/testdata/p4_14_samples/instruct6.p4 (Failed)

     117 - bmv2/testdata/p4_14_samples/issue-1436.p4 (Failed)

     118 - bmv2/testdata/p4_14_samples/issue-1559.p4 (Failed)

     119 - bmv2/testdata/p4_14_samples/issue1013.p4 (Failed)

     120 - bmv2/testdata/p4_14_samples/issue1057.p4 (Failed)

     121 - bmv2/testdata/p4_14_samples/issue1058.p4 (Failed)

     122 - bmv2/testdata/p4_14_samples/issue1237.p4 (Failed)

     123 - bmv2/testdata/p4_14_samples/issue1397.p4 (Failed)

     124 - bmv2/testdata/p4_14_samples/issue1428.p4 (Failed)

     125 - bmv2/testdata/p4_14_samples/issue583.p4 (Failed)

     128 - bmv2/testdata/p4_14_samples/issue638-2.p4 (Failed)

     129 - bmv2/testdata/p4_14_samples/issue767.p4 (Failed)

     130 - bmv2/testdata/p4_14_samples/issue780-1.p4 (Failed)

     131 - bmv2/testdata/p4_14_samples/issue780-2.p4 (Failed)

     132 - bmv2/testdata/p4_14_samples/issue780-3.p4 (Failed)

     133 - bmv2/testdata/p4_14_samples/issue780-5.p4 (Failed)

     134 - bmv2/testdata/p4_14_samples/issue780-7.p4 (Failed)

     135 - bmv2/testdata/p4_14_samples/issue780-8.p4 (Failed)

     136 - bmv2/testdata/p4_14_samples/issue780-9.p4 (Failed)

     137 - bmv2/testdata/p4_14_samples/issue781.p4 (Failed)

     138 - bmv2/testdata/p4_14_samples/issue846.p4 (Failed)

     139 - bmv2/testdata/p4_14_samples/issue894.p4 (Failed)

     140 - bmv2/testdata/p4_14_samples/issue946.p4 (Failed)

     141 - bmv2/testdata/p4_14_samples/mac_rewrite.p4 (Failed)

     142 - bmv2/testdata/p4_14_samples/meter.p4 (Failed)

     143 - bmv2/testdata/p4_14_samples/meter1.p4 (Failed)

     144 - bmv2/testdata/p4_14_samples/misc_prim.p4 (Failed)

     145 - bmv2/testdata/p4_14_samples/miss.p4 (Failed)

     146 - bmv2/testdata/p4_14_samples/name_collision.p4 (Failed)

     147 - bmv2/testdata/p4_14_samples/overflow.p4 (Failed)

     148 - bmv2/testdata/p4_14_samples/packet_redirect.p4 (Failed)

     149 - bmv2/testdata/p4_14_samples/parser-exception.p4 (Failed)

     150 - bmv2/testdata/p4_14_samples/parser1.p4 (Failed)

     151 - bmv2/testdata/p4_14_samples/parser2.p4 (Failed)

     152 - bmv2/testdata/p4_14_samples/parser3.p4 (Failed)

     153 - bmv2/testdata/p4_14_samples/parser4.p4 (Failed)

     154 - bmv2/testdata/p4_14_samples/parser_dc_full.p4 (Failed)

     155 - bmv2/testdata/p4_14_samples/parser_pragma.p4 (Failed)

     156 - bmv2/testdata/p4_14_samples/parser_pragma2.p4 (Failed)

     157 - bmv2/testdata/p4_14_samples/parser_value_set0.p4 (Failed)

     158 - bmv2/testdata/p4_14_samples/parser_value_set1.p4 (Failed)

     159 - bmv2/testdata/p4_14_samples/parser_value_set2.p4 (Failed)

     160 - bmv2/testdata/p4_14_samples/port_vlan_mapping.p4 (Failed)

     161 - bmv2/testdata/p4_14_samples/queueing.p4 (Failed)

     162 - bmv2/testdata/p4_14_samples/register.p4 (Failed)

     163 - bmv2/testdata/p4_14_samples/repeater.p4 (Failed)

     164 - bmv2/testdata/p4_14_samples/resubmit.p4 (Failed)

     165 - bmv2/testdata/p4_14_samples/sai_p4.p4 (Failed)

     166 - bmv2/testdata/p4_14_samples/saturated-bmv2.p4 (Failed)

     167 - bmv2/testdata/p4_14_samples/selector0.p4 (Failed)

     168 - bmv2/testdata/p4_14_samples/selector1.p4 (Failed)

     169 - bmv2/testdata/p4_14_samples/selector2.p4 (Failed)

     170 - bmv2/testdata/p4_14_samples/selector3.p4 (Failed)

     171 - bmv2/testdata/p4_14_samples/simple_nat.p4 (Failed)

     172 - bmv2/testdata/p4_14_samples/simple_router.p4 (Failed)

     173 - bmv2/testdata/p4_14_samples/source_routing.p4 (Failed)

     174 - bmv2/testdata/p4_14_samples/swap_1.p4 (Failed)

     175 - bmv2/testdata/p4_14_samples/swap_2.p4 (Failed)

     176 - bmv2/testdata/p4_14_samples/ternary_match0.p4 (Failed)

     177 - bmv2/testdata/p4_14_samples/ternary_match1.p4 (Failed)

     178 - bmv2/testdata/p4_14_samples/ternary_match2.p4 (Failed)

     179 - bmv2/testdata/p4_14_samples/ternary_match3.p4 (Failed)

     180 - bmv2/testdata/p4_14_samples/ternary_match4.p4 (Failed)

     181 - bmv2/testdata/p4_14_samples/test_7_storm_control.p4 (Failed)

     182 -
bmv2/testdata/p4_14_samples/test_config_175_match_table_with_no_key.p4
(Failed)

     183 -
bmv2/testdata/p4_14_samples/test_config_23_same_container_modified.p4
(Failed)

     184 - bmv2/testdata/p4_14_samples/testgw.p4 (Failed)

     185 - bmv2/testdata/p4_14_samples/tmvalid.p4 (Failed)

     186 - bmv2/testdata/p4_14_samples/tp2a.p4 (Failed)

     187 - bmv2/testdata/p4_14_samples/tp2b.p4 (Failed)

     188 - bmv2/testdata/p4_14_samples/tp2c.p4 (Failed)

     189 - bmv2/testdata/p4_14_samples/tp3a.p4 (Failed)

     190 - bmv2/testdata/p4_14_samples/triv_eth.p4 (Failed)

     191 - bmv2/testdata/p4_14_samples/triv_ipv4.p4 (Failed)

     192 - bmv2/testdata/p4_14_samples/truncate.p4 (Failed)

     193 - bmv2/testdata/p4_14_samples/validate_outer_ethernet.p4 (Failed)

     194 - bmv2/testdata/p4_14_samples/wide_action1.p4 (Failed)

     195 - bmv2/testdata/p4_14_samples/wide_action2.p4 (Failed)

     196 - bmv2/testdata/p4_14_samples/wide_action3.p4 (Failed)

     197 - bmv2/testdata/p4_16_samples/action_profile-bmv2.p4 (Failed)

     198 - bmv2/testdata/p4_16_samples/action_selector_shared-bmv2.p4
(Failed)

     199 - bmv2/testdata/p4_16_samples/action_selector_unused-bmv2.p4
(Failed)

     200 - bmv2/testdata/p4_16_samples/arith-bmv2.p4 (Failed)

     201 - bmv2/testdata/p4_16_samples/arith-inline-bmv2.p4 (Failed)

     202 - bmv2/testdata/p4_16_samples/arith1-bmv2.p4 (Failed)

     203 - bmv2/testdata/p4_16_samples/arith2-bmv2.p4 (Failed)

     204 - bmv2/testdata/p4_16_samples/arith2-inline-bmv2.p4 (Failed)

     205 - bmv2/testdata/p4_16_samples/arith3-bmv2.p4 (Failed)

     206 - bmv2/testdata/p4_16_samples/arith4-bmv2.p4 (Failed)

     207 - bmv2/testdata/p4_16_samples/arith5-bmv2.p4 (Failed)

     208 - bmv2/testdata/p4_16_samples/array-copy-bmv2.p4 (Failed)

     209 - bmv2/testdata/p4_16_samples/basic_routing-bmv2.p4 (Failed)

     210 - bmv2/testdata/p4_16_samples/checksum1-bmv2.p4 (Failed)

     211 - bmv2/testdata/p4_16_samples/clone-bmv2.p4 (Failed)

     212 - bmv2/testdata/p4_16_samples/concat-bmv2.p4 (Failed)

     213 - bmv2/testdata/p4_16_samples/constant-in-calculation-bmv2.p4
(Failed)

     214 - bmv2/testdata/p4_16_samples/crc32-bmv2.p4 (Failed)

     215 - bmv2/testdata/p4_16_samples/default_action-bmv2.p4 (Failed)

     216 - bmv2/testdata/p4_16_samples/drop-bmv2.p4 (Failed)

     217 - bmv2/testdata/p4_16_samples/enum-bmv2.p4 (Failed)

     218 - bmv2/testdata/p4_16_samples/equality-bmv2.p4 (Failed)

     219 - bmv2/testdata/p4_16_samples/equality-varbit-bmv2.p4 (Failed)

     220 - bmv2/testdata/p4_16_samples/extern-funcs-bmv2.p4 (Failed)

     221 - bmv2/testdata/p4_16_samples/flag_lost-bmv2.p4 (Failed)

     222 - bmv2/testdata/p4_16_samples/flowlet_switching-bmv2.p4 (Failed)

     223 - bmv2/testdata/p4_16_samples/hash-bmv2.p4 (Failed)

     224 - bmv2/testdata/p4_16_samples/header-bmv2.p4 (Failed)

     225 - bmv2/testdata/p4_16_samples/header-stack-ops-bmv2.p4 (Failed)

     226 - bmv2/testdata/p4_16_samples/inline-bmv2.p4 (Failed)

     227 - bmv2/testdata/p4_16_samples/inline-stack-bmv2.p4 (Failed)

     228 - bmv2/testdata/p4_16_samples/inline1-bmv2.p4 (Failed)

     229 - bmv2/testdata/p4_16_samples/intrinsic-bmv2.p4 (Failed)

     230 - bmv2/testdata/p4_16_samples/issue1000-bmv2.p4 (Failed)

     231 - bmv2/testdata/p4_16_samples/issue1001-bmv2.p4 (Failed)

     232 - bmv2/testdata/p4_16_samples/issue1025-bmv2.p4 (Failed)

     233 - bmv2/testdata/p4_16_samples/issue1043-bmv2.p4 (Failed)

     234 - bmv2/testdata/p4_16_samples/issue1049-bmv2.p4 (Failed)

     237 - bmv2/testdata/p4_16_samples/issue1079-bmv2.p4 (Failed)

     238 - bmv2/testdata/p4_16_samples/issue1097-2-bmv2.p4 (Failed)

     239 - bmv2/testdata/p4_16_samples/issue1097-bmv2.p4 (Failed)

     240 - bmv2/testdata/p4_16_samples/issue1127-bmv2.p4 (Failed)

     242 - bmv2/testdata/p4_16_samples/issue1291-bmv2.p4 (Failed)

     243 - bmv2/testdata/p4_16_samples/issue1325-bmv2.p4 (Failed)

     244 - bmv2/testdata/p4_16_samples/issue134-bmv2.p4 (Failed)

     245 - bmv2/testdata/p4_16_samples/issue1352-bmv2.p4 (Failed)

     246 - bmv2/testdata/p4_16_samples/issue1409-bmv2.p4 (Failed)

     247 - bmv2/testdata/p4_16_samples/issue1412-bmv2.p4 (Failed)

     248 - bmv2/testdata/p4_16_samples/issue1470-bmv2.p4 (Failed)

     249 - bmv2/testdata/p4_16_samples/issue1478-bmv2.p4 (Failed)

     250 - bmv2/testdata/p4_16_samples/issue1517-bmv2.p4 (Failed)

     251 - bmv2/testdata/p4_16_samples/issue1520-bmv2.p4 (Failed)

     252 - bmv2/testdata/p4_16_samples/issue1544-1-bmv2.p4 (Failed)

     253 - bmv2/testdata/p4_16_samples/issue1544-2-bmv2.p4 (Failed)

     254 - bmv2/testdata/p4_16_samples/issue1544-bmv2.p4 (Failed)

     255 - bmv2/testdata/p4_16_samples/issue1560-bmv2.p4 (Failed)

     256 - bmv2/testdata/p4_16_samples/issue1566-bmv2.p4 (Failed)

     257 - bmv2/testdata/p4_16_samples/issue1607-bmv2.p4 (Failed)

     258 - bmv2/testdata/p4_16_samples/issue232-bmv2.p4 (Failed)

     259 - bmv2/testdata/p4_16_samples/issue270-bmv2.p4 (Failed)

     260 - bmv2/testdata/p4_16_samples/issue272-1-bmv2.p4 (Failed)

     261 - bmv2/testdata/p4_16_samples/issue272-2-bmv2.p4 (Failed)

     262 - bmv2/testdata/p4_16_samples/issue297-bmv2.p4 (Failed)

     263 - bmv2/testdata/p4_16_samples/issue298-bmv2.p4 (Failed)

     264 - bmv2/testdata/p4_16_samples/issue355-bmv2.p4 (Failed)

     265 - bmv2/testdata/p4_16_samples/issue356-bmv2.p4 (Failed)

     266 - bmv2/testdata/p4_16_samples/issue361-bmv2.p4 (Failed)

     267 - bmv2/testdata/p4_16_samples/issue363-bmv2.p4 (Failed)

     268 - bmv2/testdata/p4_16_samples/issue364-bmv2.p4 (Failed)

     269 - bmv2/testdata/p4_16_samples/issue414-bmv2.p4 (Failed)

     270 - bmv2/testdata/p4_16_samples/issue430-1-bmv2.p4 (Failed)

     271 - bmv2/testdata/p4_16_samples/issue430-bmv2.p4 (Failed)

     272 - bmv2/testdata/p4_16_samples/issue447-1-bmv2.p4 (Failed)

     273 - bmv2/testdata/p4_16_samples/issue447-2-bmv2.p4 (Failed)

     274 - bmv2/testdata/p4_16_samples/issue447-3-bmv2.p4 (Failed)

     275 - bmv2/testdata/p4_16_samples/issue447-4-bmv2.p4 (Failed)

     276 - bmv2/testdata/p4_16_samples/issue447-5-bmv2.p4 (Failed)

     277 - bmv2/testdata/p4_16_samples/issue447-bmv2.p4 (Failed)

     278 - bmv2/testdata/p4_16_samples/issue461-bmv2.p4 (Failed)

     279 - bmv2/testdata/p4_16_samples/issue486-bmv2.p4 (Failed)

     280 - bmv2/testdata/p4_16_samples/issue510-bmv2.p4 (Failed)

     281 - bmv2/testdata/p4_16_samples/issue562-bmv2.p4 (Failed)

     282 - bmv2/testdata/p4_16_samples/issue635-bmv2.p4 (Failed)

     283 - bmv2/testdata/p4_16_samples/issue655-bmv2.p4 (Failed)

     284 - bmv2/testdata/p4_16_samples/issue677-bmv2.p4 (Failed)

     285 - bmv2/testdata/p4_16_samples/issue696-bmv2.p4 (Failed)

     286 - bmv2/testdata/p4_16_samples/issue737-bmv2.p4 (Failed)

     287 - bmv2/testdata/p4_16_samples/issue774-4-bmv2.p4 (Failed)

     288 - bmv2/testdata/p4_16_samples/issue891-bmv2.p4 (Failed)

     290 - bmv2/testdata/p4_16_samples/issue914-bmv2.p4 (Failed)

     291 - bmv2/testdata/p4_16_samples/issue983-bmv2.p4 (Failed)

     292 - bmv2/testdata/p4_16_samples/issue986-1-bmv2.p4 (Failed)

     294 - bmv2/testdata/p4_16_samples/issue995-bmv2.p4 (Failed)

     295 - bmv2/testdata/p4_16_samples/junk-prop-bmv2.p4 (Failed)

     296 - bmv2/testdata/p4_16_samples/key-bmv2.p4 (Failed)

     297 - bmv2/testdata/p4_16_samples/key1-bmv2.p4 (Failed)

     298 - bmv2/testdata/p4_16_samples/multicast-bmv2.p4 (Failed)

     299 - bmv2/testdata/p4_16_samples/mux-bmv2.p4 (Failed)

     300 - bmv2/testdata/p4_16_samples/named_meter_1-bmv2.p4 (Failed)

     301 - bmv2/testdata/p4_16_samples/parser_error-bmv2.p4 (Failed)

     302 - bmv2/testdata/p4_16_samples/saturated-bmv2.p4 (Failed)

     303 - bmv2/testdata/p4_16_samples/scalarmeta-bmv2.p4 (Failed)

     304 - bmv2/testdata/p4_16_samples/stack-bmv2.p4 (Failed)

     305 - bmv2/testdata/p4_16_samples/stack_complex-bmv2.p4 (Failed)

     306 - bmv2/testdata/p4_16_samples/subparser-with-header-stack-bmv2.p4
(Failed)

     307 - bmv2/testdata/p4_16_samples/table-entries-exact-bmv2.p4 (Failed)

     308 - bmv2/testdata/p4_16_samples/table-entries-exact-ternary-bmv2.p4
(Failed)

     309 - bmv2/testdata/p4_16_samples/table-entries-lpm-bmv2.p4 (Failed)

     310 - bmv2/testdata/p4_16_samples/table-entries-priority-bmv2.p4
(Failed)

     311 - bmv2/testdata/p4_16_samples/table-entries-range-bmv2.p4 (Failed)

     312 - bmv2/testdata/p4_16_samples/table-entries-ternary-bmv2.p4
(Failed)

     313 - bmv2/testdata/p4_16_samples/table-entries-valid-bmv2.p4 (Failed)

     314 - bmv2/testdata/p4_16_samples/ternary2-bmv2.p4 (Failed)

     315 - bmv2/testdata/p4_16_samples/union-bmv2.p4 (Failed)

     316 - bmv2/testdata/p4_16_samples/union-valid-bmv2.p4 (Failed)

     317 - bmv2/testdata/p4_16_samples/union1-bmv2.p4 (Failed)

     318 - bmv2/testdata/p4_16_samples/union2-bmv2.p4 (Failed)

     319 - bmv2/testdata/p4_16_samples/union3-bmv2.p4 (Failed)

     320 - bmv2/testdata/p4_16_samples/union4-bmv2.p4 (Failed)

     321 - bmv2/testdata/p4_16_samples/unused-counter-bmv2.p4 (Failed)

     322 - bmv2/testdata/p4_16_samples/v1model-special-ops-bmv2.p4 (Failed)

     323 - bmv2/testdata/p4_16_samples/verify-bmv2.p4 (Failed)

     324 - bmv2/testdata/p4_16_samples/x-bmv2.p4 (Failed)

     325 - bmv2/bmv2_emit_externs (Failed)

Errors while running CTest

CMakeFiles/check-all.dir/build.make:57: recipe for target
'CMakeFiles/check-all' failed

make[3]: *** [CMakeFiles/check-all] Error 8

CMakeFiles/Makefile2:616: recipe for target 'CMakeFiles/check-all.dir/all'
failed

make[2]: *** [CMakeFiles/check-all.dir/all] Error 2

CMakeFiles/Makefile2:138: recipe for target 'CMakeFiles/check.dir/rule'
failed

make[1]: *** [CMakeFiles/check.dir/rule] Error 2

Makefile:201: recipe for target 'check' failed

make: *** [check] Error 2

 

Hemant

 

 

-------------- next part --------------
An HTML attachment was scrubbed...
URL: <http://lists.p4.org/pipermail/p4-dev_lists.p4.org/attachments/20181209/9e675fb9/attachment-0001.html>


More information about the P4-dev mailing list